Target
Receptor-type tyrosine-protein phosphatase C
Ligand
BDBM50311254
Substrate
Meas. Tech.
ChEMBL_620191 (CHEMBL1115826)
IC50
>44000±n/a nM
Citation
 Seo, CSohn, JHOh, HKim, BYAhn, JS Isolation of the protein tyrosine phosphatase 1B inhibitory metabolite from the marine-derived fungus Cosmospora sp. SF-5060. Bioorg Med Chem Lett 19:6095-7 (2009)  
Target
Name:
Receptor-type tyrosine-protein phosphatase C
Synonyms:
CD45 L-CA PTPRC Receptor-type tyrosine-protein phosphatase C (CD45) | T200
Type:
Protein
Mol. Mass.:
147474.19
Organism:
Homo sapiens (Human)
Description:
P08575
Residue:
1306
  
Inhibitor
Name:
BDBM50311254
Synonyms:
2-hydroxy-4-(2-hydroxy-6-pentadecyl-4-((2S,3R,4S,5S,6R)-3,4,5-trihydroxy-6-(hydroxymethyl)tetrahydro-2H-pyran-2-yloxy)benzoyloxy)-6-methylbenzoic acid | CHEMBL1077438
Type:
Small organic molecule
Emp. Form.:
C36H52O12
Mol. Mass.:
676.7909
SMILES:
CCCCCCCCCCCCCCCc1cc(O[C@@H]2O[C@H](CO)[C@@H](O)[C@H](O)[C@H]2O)cc(O)c1C(=O)Oc1cc(C)c(C(O)=O)c(O)c1
: