Target
Ephrin type-B receptor 3
Ligand
BDBM50311300
Substrate
Meas. Tech.
ChEMBL_620507 (CHEMBL1107575)
IC50
20000±n/a nM
Citation
 Qiao, LChoi, SCase, AGainer, TGSeyb, KGlicksman, MALo, DCStein, RLCuny, GD Structure-activity relationship study of EphB3 receptor tyrosine kinase inhibitors. Bioorg Med Chem Lett 19:6122-6 (2009)  
Target
Name:
Ephrin type-B receptor 3
Synonyms:
EPHB3 ETK2 Ephrin type-B receptor 3 HEK2 Tyrosine Kinase EPHB3
Type:
Protein
Mol. Mass.:
110326.17
Organism:
Homo sapiens (Human)
Description:
P54753
Residue:
998
  
Inhibitor
Name:
BDBM50311300
Synonyms:
6-chloro-N-(2-chlorophenyl)pyrazolo[1,5-a]pyridine-3-carboxamide | CHEMBL1080958
Type:
Small organic molecule
Emp. Form.:
C14H9Cl2N3O
Mol. Mass.:
306.147
SMILES:
Clc1ccc2c(cnn2c1)C(=O)Nc1ccccc1Cl
: