Target
cAMP-dependent protein kinase catalytic subunit alpha
Ligand
BDBM50311407
Substrate
Meas. Tech.
ChEMBL_622263 (CHEMBL1110408)
IC50
61±n/a nM
Citation
 Enkvist, EKriisa, MRoben, MKadak, GRaidaru, GUri, A Effect of the structure of adenosine mimic of bisubstrate-analog inhibitors on their activity towards basophilic protein kinases. Bioorg Med Chem Lett 19:6098-101 (2009)  
Target
Name:
cAMP-dependent protein kinase catalytic subunit alpha
Synonyms:
KAPCA_HUMAN PKACA cAMP-dependent protein kinase (PKA) cAMP-dependent protein kinase catalytic subunit alpha cAMP-dependent protein kinase catalytic subunit alpha (PKACA) cAMP-dependent protein kinase catalytic subunit alpha isoform 1 | cAMP-dependent protein kinase, alpha-catalytic subunit
Type:
Enzyme Catalytic Subunit
Mol. Mass.:
40598.73
Organism:
Homo sapiens (Human)
Description:
Residue:
351
  
Inhibitor
Name:
BDBM50311407
Synonyms:
CHEMBL1077371 | N-((6R,9R,19R)-1-amino-19-(4-aminobutyl)-6-carbamoyl-9-(3-guanidinopropyl)-1-imino-8,11,18,21-tetraoxo-2,7,10,17,20-pentaazahexacosan-26-yl)-3-(2-aminopyrimidin-4-yl)benzamide
Type:
Small organic molecule
Emp. Form.:
C41H68N16O6
Mol. Mass.:
881.0822
SMILES:
[#7]-[#6]-[#6]-[#6]-[#6]-[#6@@H](-[#7]-[#6](=O)-[#6]-[#6]-[#6]-[#6]-[#6]-[#7]-[#6](=O)-c1cccc(c1)-c1ccnc(-[#7])n1)-[#6](=O)-[#7]-[#6]-[#6]-[#6]-[#6]-[#6]-[#6](=O)-[#7]-[#6@H](-[#6]-[#6]-[#6]\[#7]=[#6](\[#7])-[#7])-[#6](=O)-[#7]-[#6@H](-[#6]-[#6]-[#6]\[#7]=[#6](\[#7])-[#7])-[#6](-[#7])=O
: