Target
Motilin receptor
Ligand
BDBM50415664
Substrate
Meas. Tech.
ChEMBL_622559 (CHEMBL1117503)
EC50
19.95±n/a nM
Citation
 Bailey, JMScott, JSBasilla, JBBolton, VJBoyfield, IEvans, DGFleury, EHeightman, TDJarvie, EMLawless, KMatthews, KLMcKay, FMok, HMuir, AOrlek, BSSanger, GJStemp, GStevens, AJThompson, MWard, JVaidya, KWestaway, SM The discovery and optimisation of benzazepine sulfonamide and sulfones as potent agonists of the motilin receptor. Bioorg Med Chem Lett 19:6452-8 (2009)  
Target
Name:
Motilin receptor
Synonyms:
G-protein coupled receptor 38 MLNR MTLR1 | MTLR_HUMAN
Type:
PROTEIN
Mol. Mass.:
45365.95
Organism:
Homo sapiens (Human)
Description:
ChEMBL_122664
Residue:
412
  
Inhibitor
Name:
BDBM50415664
Synonyms:
CHEMBL1078344
Type:
Small organic molecule
Emp. Form.:
C23H22ClNO2S
Mol. Mass.:
411.944
SMILES:
Clc1ccc(cc1)-c1ccc(cc1)S(=O)(=O)Cc1ccc2CCNCCc2c1
: