Target
Deoxycytidine kinase
Ligand
BDBM50311539
Substrate
Meas. Tech.
ChEMBL_618319 (CHEMBL1101183)
IC50
510000±n/a nM
Citation
 Tarver, JEJessop, TCCarlsen, MAugeri, DJFu, QHealy, JPHeim-Riether, AXu, ATaylor, JAShen, MKeyes, PEDavid Kimball, SYu, XCMiranda, MLiu, QSwaffield, JCNouraldeen, AWilson, AGFinch, RJhaver, KFoushee, AMAnderson, SOravecz, TCarson, KG 5-Fluorocytosine derivatives as inhibitors of deoxycytidine kinase. Bioorg Med Chem Lett 19:6780-3 (2009)  
Target
Name:
Deoxycytidine kinase
Synonyms:
DCK | DCK_HUMAN
Type:
PROTEIN
Mol. Mass.:
30510.65
Organism:
Homo sapiens (Human)
Description:
ChEMBL_1437135
Residue:
260
  
Inhibitor
Name:
BDBM50311539
Synonyms:
2-(4-(6-(benzo[b]thiophen-2-yl)pyrimidin-4-yl)piperazin-1-yl)-1-(pyrrolidin-1-yl)ethanone CHEMBL1081559
Type:
Small organic molecule
Emp. Form.:
C22H25N5OS
Mol. Mass.:
407.532
SMILES:
O=C(CN1CCN(CC1)c1cc(ncn1)-c1cc2ccccc2s1)N1CCCC1
: