Target
Deoxycytidine kinase
Ligand
BDBM50311543
Substrate
Meas. Tech.
ChEMBL_618319 (CHEMBL1101183)
IC50
34±n/a nM
Citation
 Tarver, JEJessop, TCCarlsen, MAugeri, DJFu, QHealy, JPHeim-Riether, AXu, ATaylor, JAShen, MKeyes, PEDavid Kimball, SYu, XCMiranda, MLiu, QSwaffield, JCNouraldeen, AWilson, AGFinch, RJhaver, KFoushee, AMAnderson, SOravecz, TCarson, KG 5-Fluorocytosine derivatives as inhibitors of deoxycytidine kinase. Bioorg Med Chem Lett 19:6780-3 (2009)  
Target
Name:
Deoxycytidine kinase
Synonyms:
DCK | DCK_HUMAN
Type:
PROTEIN
Mol. Mass.:
30510.65
Organism:
Homo sapiens (Human)
Description:
ChEMBL_1437135
Residue:
260
  
Inhibitor
Name:
BDBM50311543
Synonyms:
2-((1-(6-(benzo[b]thiophen-2-yl)pyrimidin-4-yl)piperidin-4-yl)methoxy)-5-fluoropyrimidin-4-amine | CHEMBL1079585
Type:
Small organic molecule
Emp. Form.:
C22H21FN6OS
Mol. Mass.:
436.505
SMILES:
Nc1nc(OCC2CCN(CC2)c2cc(ncn2)-c2cc3ccccc3s2)ncc1F
: