Target
Histone-arginine methyltransferase CARM1
Ligand
BDBM50311701
Substrate
Meas. Tech.
ChEMBL_618689 (CHEMBL1102467)
IC50
6500±n/a nM
Citation
 Therrien, ELarouche, GManku, SAllan, MNguyen, NStyhler, SRobert, MFGoulet, ACBesterman, JMNguyen, HWahhab, A 1,2-Diamines as inhibitors of co-activator associated arginine methyltransferase 1 (CARM1). Bioorg Med Chem Lett 19:6725-32 (2009)  
Target
Name:
Histone-arginine methyltransferase CARM1
Synonyms:
CARM1_MOUSE Coactivator-associated arginine methyltransferase 1 Prmt4 | Protein arginine N-methyltransferase 4
Type:
Homodimer; chromatin regulator; methyltransferase
Mol. Mass.:
65855.95
Organism:
Mus musculus (mouse)
Description:
Assays were using N-terminal His-tagged, recombinant mouse CARM1 (expressed in Sf9 cells and purified using Ni-NTA agarose chromatography).
Residue:
608
  
Inhibitor
Name:
BDBM50311701
Synonyms:
1-(3-((2-(methylamino)ethylamino)methyl)phenyl)-N-(2-(trifluoromethoxy)benzyl)-3-(trifluoromethyl)-1H-pyrazole-5-carboxamide | CHEMBL1087115
Type:
Small organic molecule
Emp. Form.:
C23H23F6N5O2
Mol. Mass.:
515.4514
SMILES:
CNCCNCc1cccc(c1)-n1nc(cc1C(=O)NCc1ccccc1OC(F)(F)F)C(F)(F)F
: