Target
Tyrosine-protein kinase Lck
Ligand
BDBM50311926
Substrate
Meas. Tech.
ChEMBL_619936 (CHEMBL1113978)
IC50
3±n/a nM
Citation
 Zhang, GRen, PGray, NSSim, TWang, XLiu, YChe, JDong, WTian, SSSandberg, MLSpalding, TARomeo, RIskandar, MWang, ZSeidel, HMKaranewsky, DSHe, Y Discovery of pyrimidine benzimidazoles as Src-family selective Lck inhibitors. Part II. Bioorg Med Chem Lett 19:6691-5 (2009)  
Target
Name:
Tyrosine-protein kinase Lck
Synonyms:
2.7.10.2 LCK_HUMAN Leukocyte C-terminal Src kinase Lymphocyte-specific protein tyrosine kinase Protein YT16 Proto-oncogene tyrosine-protein kinase LCK T cell-specific protein-tyrosine kinase
Type:
Mol. Mass.:
57987.83
Organism:
Homo sapiens (Human)
Description:
P06239
Residue:
509
  
Inhibitor
Name:
BDBM50311926
Synonyms:
CHEMBL1076436 | N-(3-(1-(6-aminopyrimidin-4-yl)-1H-benzo[d]imidazol-2-ylamino)-4-methylphenyl)-3-(4-methylpiperazin-1-yl)-5-(trifluoromethyl)benzamide
Type:
Small organic molecule
Emp. Form.:
C31H30F3N9O
Mol. Mass.:
601.6248
SMILES:
CN1CCN(CC1)c1cc(cc(c1)C(F)(F)F)C(=O)Nc1ccc(C)c(Nc2nc3ccccc3n2-c2cc(N)ncn2)c1
: