Target
Tyrosine-protein kinase Lyn
Ligand
BDBM50311901
Substrate
Meas. Tech.
ChEMBL_619937 (CHEMBL1113979)
IC50
15±n/a nM
Citation
 Zhang, GRen, PGray, NSSim, TWang, XLiu, YChe, JDong, WTian, SSSandberg, MLSpalding, TARomeo, RIskandar, MWang, ZSeidel, HMKaranewsky, DSHe, Y Discovery of pyrimidine benzimidazoles as Src-family selective Lck inhibitors. Part II. Bioorg Med Chem Lett 19:6691-5 (2009)  
Target
Name:
Tyrosine-protein kinase Lyn
Synonyms:
JTK8 LYN_HUMAN Tyrosine-protein kinase Lyn (LYN) p53Lyn | p56Lyn
Type:
Protein
Mol. Mass.:
58575.92
Organism:
Homo sapiens (Human)
Description:
P07948
Residue:
512
  
Inhibitor
Name:
BDBM50311901
Synonyms:
3-(1-(6-aminopyrimidin-4-yl)-1H-benzo[d]imidazol-2-ylamino)-4-methyl-N-(3-(trifluoromethyl)phenyl)benzamide | CHEMBL1087524
Type:
Small organic molecule
Emp. Form.:
C26H20F3N7O
Mol. Mass.:
503.4785
SMILES:
Cc1ccc(cc1Nc1nc2ccccc2n1-c1cc(N)ncn1)C(=O)Nc1cccc(c1)C(F)(F)F
: