Target
Mitogen-activated protein kinase 1
Ligand
BDBM50311953
Substrate
Meas. Tech.
ChEMBL_619944 (CHEMBL1113986)
IC50
>50000±n/a nM
Citation
 Shim, JEid, CLee, JLiu, EChaudhary, DBoschelli, DH Synthesis and PKCtheta inhibitory activity of a series of 5-vinyl phenyl sulfonamide-3-pyridinecarbonitriles. Bioorg Med Chem Lett 19:6575-7 (2009)  
Target
Name:
Mitogen-activated protein kinase 1
Synonyms:
ERK2 Extracellular signal-regulated kinase 2 Extracellular signal-regulated kinase 2 (ERK2) MAPK 2 MK01_HUMAN Mitogen-activated protein kinase 1 (ERK-2) Mitogen-activated protein kinase 2 PRKM2 | p42-MAPK
Type:
Ser/Thr Protein Kinase
Mol. Mass.:
41392.76
Organism:
Homo sapiens (Human)
Description:
P28482
Residue:
360
  
Inhibitor
Name:
BDBM50311953
Synonyms:
4-(4-methyl-1H-indol-5-ylamino)-5-(3-(4-methylpiperazin-1-ylsulfonyl)styryl)nicotinonitrile | CHEMBL1080994
Type:
Small organic molecule
Emp. Form.:
C28H28N6O2S
Mol. Mass.:
512.626
SMILES:
CN1CCN(CC1)S(=O)(=O)c1cccc(\C=C\c2cncc(C#N)c2Nc2ccc3[nH]ccc3c2C)c1
: