Target
Angiopoietin-1 receptor
Ligand
BDBM50311975
Substrate
Meas. Tech.
ChEMBL_620194 (CHEMBL1115829)
IC50
490±n/a nM
Citation
 Luke, RWBallard, PButtar, DCampbell, LCurwen, JEmery, SCGriffen, AMHassall, LHayter, BRJones, CDMcCoull, WMellor, MSwain, MLTucker, JA Novel thienopyrimidine and thiazolopyrimidine kinase inhibitors with activity against Tie-2 in vitro and in vivo. Bioorg Med Chem Lett 19:6670-4 (2009)  
Target
Name:
Angiopoietin-1 receptor
Synonyms:
TEK TIE2_HUMAN Tyrosine-protein kinase receptor (TIE-2) Tyrosine-protein kinase receptor TEK (p140 TEK) Tyrosine-protein kinase receptor TIE2/TEK VMCM1 p140 TEK
Type:
Enzyme
Mol. Mass.:
125835.70
Organism:
Homo sapiens (Human)
Description:
Q02763
Residue:
1124
  
Inhibitor
Name:
BDBM50311975
Synonyms:
2-(1-isobutyl-4-phenyl-1H-imidazol-5-yl)thiazolo[5,4-d]pyrimidin-7-amine | CHEMBL1079590
Type:
Small organic molecule
Emp. Form.:
C18H18N6S
Mol. Mass.:
350.441
SMILES:
CC(C)Cn1cnc(c1-c1nc2c(N)ncnc2s1)-c1ccccc1
: