Target
Dual specificity mitogen-activated protein kinase kinase 6
Ligand
BDBM50312057
Substrate
Meas. Tech.
ChEMBL_620622 (CHEMBL1114830)
IC50
>2000±n/a nM
Citation
 Berger, DMTorres, NDutia, MPowell, DCiszewski, GGopalsamy, ALevin, JIKim, KHXu, WWilhelm, JHu, YCollins, KFeldberg, LKim, SFrommer, EWojciechowicz, DMallon, R Non-hinge-binding pyrazolo[1,5-a]pyrimidines as potent B-Raf kinase inhibitors. Bioorg Med Chem Lett 19:6519-23 (2009)  
Target
Name:
Dual specificity mitogen-activated protein kinase kinase 6
Synonyms:
Dual specificity mitogen-activated protein kinase kinase 6 MAP2K6 MAPKK 6 MKK6 Mitogen-activated protein kinase kinase 6 (MKK6) SAPKK3 | SKK3
Type:
Protein
Mol. Mass.:
37494.96
Organism:
Homo sapiens (Human)
Description:
P52564
Residue:
334
  
Inhibitor
Name:
BDBM50312057
Synonyms:
CHEMBL1087397 N-[3-(3-{4-[(dimethylamino)methyl]phenyl}pyrazolo[1,5-a]pyrimidin-7-yl)phenyl]-3-(trifluoromethyl)benzamide
Type:
Small organic molecule
Emp. Form.:
C29H24F3N5O
Mol. Mass.:
515.529
SMILES:
CN(C)Cc1ccc(cc1)-c1cnn2c(ccnc12)-c1cccc(NC(=O)c2cccc(c2)C(F)(F)F)c1
: