Target
Ephrin type-A receptor 2
Ligand
BDBM50312153
Substrate
Meas. Tech.
ChEMBL_621333 (CHEMBL1109426)
IC50
35±n/a nM
Citation
 Mitchell, SADanca, MDBlomgren, PADarrow, JWCurrie, KSKropf, JELee, SHGallion, SLXiong, JMPippin, DADeSimone, RWBrittelli, DREustice, DCBourret, AHill-Drzewi, MMaciejewski, PMElkin, LL Imidazo[1,2-a]pyrazine diaryl ureas: inhibitors of the receptor tyrosine kinase EphB4. Bioorg Med Chem Lett 19:6991-5 (2009)  
Target
Name:
Ephrin type-A receptor 2
Synonyms:
ECK EPHA2_HUMAN Epithelial cell kinase | Tyrosine-protein kinase receptor ECK
Type:
PROTEIN
Mol. Mass.:
108260.70
Organism:
Homo sapiens (Human)
Description:
ChEMBL_1505248
Residue:
976
  
Inhibitor
Name:
BDBM50312153
Synonyms:
1-(3-(8-(pyridin-4-ylmethylamino)imidazo[1,2-a]pyrazin-6-yl)phenyl)-3-(3-(trifluoromethyl)phenyl)urea | CHEMBL1081198
Type:
Small organic molecule
Emp. Form.:
C26H20F3N7O
Mol. Mass.:
503.4785
SMILES:
FC(F)(F)c1cccc(NC(=O)Nc2cccc(c2)-c2cn3ccnc3c(NCc3ccncc3)n2)c1
: