Target
Ephrin type-B receptor 4
Ligand
BDBM50312178
Substrate
Meas. Tech.
ChEMBL_621633 (CHEMBL1115704)
IC50
77±n/a nM
Citation
 Mitchell, SADanca, MDBlomgren, PADarrow, JWCurrie, KSKropf, JELee, SHGallion, SLXiong, JMPippin, DADeSimone, RWBrittelli, DREustice, DCBourret, AHill-Drzewi, MMaciejewski, PMElkin, LL Imidazo[1,2-a]pyrazine diaryl ureas: inhibitors of the receptor tyrosine kinase EphB4. Bioorg Med Chem Lett 19:6991-5 (2009)  
Target
Name:
Ephrin type-B receptor 4
Synonyms:
EPHB4 Ephrin receptor HTK MYK1 Tyrosine-protein kinase TYRO11 | VHL/Ephrin type-B receptor 4
Type:
Enzyme
Mol. Mass.:
108273.51
Organism:
Homo sapiens (Human)
Description:
P54760
Residue:
987
  
Inhibitor
Name:
BDBM50312178
Synonyms:
1-(5-chloro-2-methoxyphenyl)-3-(3-(8-(pyridin-4-ylmethylamino)imidazo[1,2-a]pyrazin-6-yl)phenyl)urea | CHEMBL1081403
Type:
Small organic molecule
Emp. Form.:
C26H22ClN7O2
Mol. Mass.:
499.952
SMILES:
COc1ccc(Cl)cc1NC(=O)Nc1cccc(c1)-c1cn2ccnc2c(NCc2ccncc2)n1
: