Target
Low molecular weight protein-tyrosine phosphatase A
Ligand
BDBM50312254
Substrate
Meas. Tech.
ChEMBL_621991 (CHEMBL1106782)
Ki
18500±n/a nM
Citation
 Rawls, KALang, PTTakeuchi, JImamura, SBaguley, TDGrundner, CAlber, TEllman, JA Fragment-based discovery of selective inhibitors of the Mycobacterium tuberculosis protein tyrosine phosphatase PtpA. Bioorg Med Chem Lett 19:6851-4 (2009)  
Target
Name:
Low molecular weight protein-tyrosine phosphatase A
Synonyms:
PTPA_MYCTU Probable low molecular weight protein-tyrosine-phosphatase mptpA | ptpA
Type:
Hydrolase
Mol. Mass.:
17891.84
Organism:
Mycobacterium tuberculosis
Description:
Residue:
163
  
Inhibitor
Name:
BDBM50312254
Synonyms:
CHEMBL1080494 | difluoro(4-(4-(trifluoromethyl)phenylcarbamoyl)phenyl)methylphosphonic acid
Type:
Small organic molecule
Emp. Form.:
C15H11F5NO4P
Mol. Mass.:
395.2179
SMILES:
OP(O)(=O)C(F)(F)c1ccc(cc1)C(=O)Nc1ccc(cc1)C(F)(F)F
: