Target
Receptor-type tyrosine-protein phosphatase F
Ligand
BDBM50312261
Substrate
Meas. Tech.
ChEMBL_621997 (CHEMBL1106788)
Ki
>100000±n/a nM
Citation
 Rawls, KALang, PTTakeuchi, JImamura, SBaguley, TDGrundner, CAlber, TEllman, JA Fragment-based discovery of selective inhibitors of the Mycobacterium tuberculosis protein tyrosine phosphatase PtpA. Bioorg Med Chem Lett 19:6851-4 (2009)  
Target
Name:
Receptor-type tyrosine-protein phosphatase F
Synonyms:
LAR Leukocyte common antigen related (LAR) PTPRF_HUMAN Receptor-type tyrosine-protein phosphatase F (LAR)
Type:
Protein
Mol. Mass.:
212869.85
Organism:
Homo sapiens (Human)
Description:
P10586
Residue:
1907
  
Inhibitor
Name:
BDBM50312261
Synonyms:
(4-(4-bromo-3,5-bis(trifluoromethyl)phenylcarbamoyl)phenyl)difluoromethylphosphonic acid | CHEMBL1081579
Type:
Small organic molecule
Emp. Form.:
C16H9BrF8NO4P
Mol. Mass.:
542.112
SMILES:
OP(O)(=O)C(F)(F)c1ccc(cc1)C(=O)Nc1cc(c(Br)c(c1)C(F)(F)F)C(F)(F)F
: