Target
Sucrase-isomaltase, intestinal
Ligand
BDBM50163445
Substrate
Meas. Tech.
ChEMBL_617530 (CHEMBL1099880)
IC50
220000±n/a nM
Citation
 Wennekes, TMeijer, AJGroen, AKBoot, RGGroener, JEvan Eijk, MOttenhoff, RBijl, NGhauharali, KSong, HO'Shea, TJLiu, HYew, NCopeland, Dvan den Berg, RJvan der Marel, GAOverkleeft, HSAerts, JM Dual-action lipophilic iminosugar improves glycemic control in obese rodents by reduction of visceral glycosphingolipids and buffering of carbohydrate assimilation. J Med Chem 53:689-98 (2010)  
Target
Name:
Sucrase-isomaltase, intestinal
Synonyms:
Alpha glucosidase SI Sucrase Sucrase-isomaltase, intestinal
Type:
PROTEIN
Mol. Mass.:
209423.23
Organism:
Homo sapiens (Human)
Description:
ChEMBL_1435477
Residue:
1827
  
Inhibitor
Name:
BDBM50163445
Synonyms:
(2S,3S,4R,5S)-2-Hydroxymethyl-piperidine-3,4,5-triol L-altro-1-Deoxynojirimycin
Type:
Small organic molecule
Emp. Form.:
C6H13NO4
Mol. Mass.:
163.1717
SMILES:
OC[C@@H]1NC[C@H](O)[C@@H](O)[C@H]1O
: