Target
Sucrase-isomaltase, intestinal
Ligand
BDBM50312529
Substrate
Meas. Tech.
ChEMBL_617530 (CHEMBL1099880)
IC50
3500±n/a nM
Citation
 Wennekes, TMeijer, AJGroen, AKBoot, RGGroener, JEvan Eijk, MOttenhoff, RBijl, NGhauharali, KSong, HO'Shea, TJLiu, HYew, NCopeland, Dvan den Berg, RJvan der Marel, GAOverkleeft, HSAerts, JM Dual-action lipophilic iminosugar improves glycemic control in obese rodents by reduction of visceral glycosphingolipids and buffering of carbohydrate assimilation. J Med Chem 53:689-98 (2010)  
Target
Name:
Sucrase-isomaltase, intestinal
Synonyms:
Alpha glucosidase SI Sucrase Sucrase-isomaltase, intestinal
Type:
PROTEIN
Mol. Mass.:
209423.23
Organism:
Homo sapiens (Human)
Description:
ChEMBL_1435477
Residue:
1827
  
Inhibitor
Name:
BDBM50312529
Synonyms:
CHEMBL1088158 | N-[5-(Adamantan-1-yl-methoxy)-pentyl]-D-galacto-1-deoxynojirimycin
Type:
Small organic molecule
Emp. Form.:
C22H39NO5
Mol. Mass.:
397.5488
SMILES:
OC[C@@H]1[C@H](O)[C@H](O)[C@@H](O)CN1CCCCCOCC12CC3CC(CC(C3)C1)C2
: