Target
Non-lysosomal glucosylceramidase
Ligand
BDBM50312531
Substrate
Meas. Tech.
ChEMBL_617534 (CHEMBL1099884)
IC50
500±n/a nM
Citation
 Wennekes, TMeijer, AJGroen, AKBoot, RGGroener, JEvan Eijk, MOttenhoff, RBijl, NGhauharali, KSong, HO'Shea, TJLiu, HYew, NCopeland, Dvan den Berg, RJvan der Marel, GAOverkleeft, HSAerts, JM Dual-action lipophilic iminosugar improves glycemic control in obese rodents by reduction of visceral glycosphingolipids and buffering of carbohydrate assimilation. J Med Chem 53:689-98 (2010)  
Target
Name:
Non-lysosomal glucosylceramidase
Synonyms:
Beta-glucosidase GBA2_HUMAN SPG46
Type:
PROTEIN
Mol. Mass.:
104639.04
Organism:
Homo sapiens (Human)
Description:
ChEMBL_1435476
Residue:
927
  
Inhibitor
Name:
BDBM50312531
Synonyms:
CHEMBL1088292 | N-[5-(Adamantan-1-yl-methoxy)-pentyl]-L-altro-1-deoxynojirimycin
Type:
Small organic molecule
Emp. Form.:
C22H39NO5
Mol. Mass.:
397.5488
SMILES:
OC[C@H]1[C@H](O)[C@H](O)[C@@H](O)CN1CCCCCOCC12CC3CC(CC(C3)C1)C2
: