Target
Cannabinoid receptor 1
Ligand
BDBM50312582
Substrate
Meas. Tech.
ChEMBL_615551 (CHEMBL1107820)
Ki
1.6±n/a nM
Citation
 Meng, TWang, JPeng, HFang, GLi, MXiong, BXie, XZhang, YWang, XShen, J Discovery of benzhydrylpiperazine derivatives as CB1 receptor inverse agonists via privileged structure-based approach. Eur J Med Chem 45:1133-9 (2010)  
Target
Name:
Cannabinoid receptor 1
Synonyms:
CANN6 CB-R CNR CNR1_HUMAN Cannabinoid receptor Cannabinoid receptor 1 (brain)
Type:
G Protein-Coupled Receptor (GPCR)
Mol. Mass.:
52868.96
Organism:
Homo sapiens (Human)
Description:
P21554
Residue:
472
  
Inhibitor
Name:
BDBM50312582
Synonyms:
CHEMBL1088728 | N-Cyclohexyl-4-[(2,4-dichlorophenyl)(phenyl)methyl]-piperazine-1-carboxamide
Type:
Small organic molecule
Emp. Form.:
C24H29Cl2N3O
Mol. Mass.:
446.413
SMILES:
Clc1ccc(C(N2CCN(CC2)C(=O)NC2CCCCC2)c2ccccc2)c(Cl)c1
: