Target
Histamine H2 receptor
Ligand
BDBM50312770
Substrate
Meas. Tech.
ChEMBL_615848 (CHEMBL1101958)
Ki
>10000±n/a nM
Citation
 Yu, MLizarzaburu, MBeckmann, HConnors, RDai, KHaller, KLi, CLiang, LLindstrom, MMa, JMotani, AWanska, MZhang, ALi, LMedina, JC Identification of piperazine-bisamide GHSR antagonists for the treatment of obesity. Bioorg Med Chem Lett 20:1758-62 (2010)  
Target
Name:
Histamine H2 receptor
Synonyms:
Gastric receptor I HISTAMINE H2 HRH2_HUMAN Histamine H2-Gs alpha S
Type:
G Protein-Coupled Receptor (GPCR)
Mol. Mass.:
40115.31
Organism:
Homo sapiens (Human)
Description:
Residue:
359
  
Inhibitor
Name:
BDBM50312770
Synonyms:
(4-(1H-indole-6-carbonyl)piperazin-1-yl)(biphenyl-4-yl)methanone | CHEMBL1076586
Type:
Small organic molecule
Emp. Form.:
C26H23N3O2
Mol. Mass.:
409.4797
SMILES:
O=C(N1CCN(CC1)C(=O)c1ccc2cc[nH]c2c1)c1ccc(cc1)-c1ccccc1
: