Target
Acetylcholinesterase
Ligand
BDBM50312807
Substrate
Meas. Tech.
ChEMBL_615849 (CHEMBL1101959)
IC50
>100000±n/a nM
Citation
 Takahashi, JHijikuro, IKihara, TMurugesh, MGFuse, SKunimoto, RTsumura, YAkaike, ANiidome, TOkuno, YTakahashi, TSugimoto, H Design, synthesis, evaluation and QSAR analysis of N(1)-substituted norcymserine derivatives as selective butyrylcholinesterase inhibitors. Bioorg Med Chem Lett 20:1718-20 (2010)  
Target
Name:
Acetylcholinesterase
Synonyms:
ACES_MOUSE Acetylcholinesterase (mouse AChE) Ache
Type:
Enzyme
Mol. Mass.:
68165.65
Organism:
Mus musculus (mouse)
Description:
Residue:
614
  
Inhibitor
Name:
BDBM50312807
Synonyms:
(3aS,8aR)-1-(4-fluorophenethyl)-3a,8-dimethyl-1,2,3,3a,8,8a-hexahydropyrrolo[2,3-b]indol-5-yl 4-isopropylphenylcarbamate | CHEMBL1087623
Type:
Small organic molecule
Emp. Form.:
C30H34FN3O2
Mol. Mass.:
487.6083
SMILES:
CC(C)c1ccc(NC(=O)Oc2ccc3N(C)[C@H]4N(CCc5ccc(F)cc5)CC[C@@]4(C)c3c2)cc1
: