Target
Mu-type opioid receptor
Ligand
BDBM50312860
Substrate
Meas. Tech.
ChEMBL_615875 (CHEMBL1102709)
Ki
7.8±n/a nM
Citation
 Ballet, SMarczak, EDFeytens, DSalvadori, SSasaki, YAbell, ADLazarus, LHBalboni, GTourwé, D Novel multiple opioid ligands based on 4-aminobenzazepinone (Aba), azepinoindole (Aia) and tetrahydroisoquinoline (Tic) scaffolds. Bioorg Med Chem Lett 20:1610-3 (2010)  
Target
Name:
Mu-type opioid receptor
Synonyms:
MOR-1 Mu-type opioid receptor (MOR) OPRM_RAT Opioid receptor B Ror-b
Type:
G Protein-Coupled Receptor (GPCR)
Mol. Mass.:
44503.11
Organism:
Rattus norvegicus (rat)
Description:
Competition binding assays were carried out using membrane preparations from transfected HN9.10 cells that constitutively expressed the mu opioid receptor.
Residue:
398
  
Inhibitor
Name:
BDBM50312860
Synonyms:
(S,S,3S,3'S,3''S)-N,N',N''-(2,2',2''-nitrilotris(ethane-2,1-diyl))tris(2-((S)-2-amino-3-(4-hydroxy-2,6-dimethylphenyl)propanoyl)-1,2,3,4-tetrahydroisoquinoline-3-carboxamide) | CHEMBL1076725
Type:
Small organic molecule
Emp. Form.:
C69H84N10O9
Mol. Mass.:
1197.4669
SMILES:
Cc1cc(O)cc(C)c1C[C@H](N)C(=O)N1Cc2ccccc2C[C@H]1C(=O)NCCN(CCNC(=O)[C@@H]1Cc2ccccc2CN1C(=O)[C@@H](N)Cc1c(C)cc(O)cc1C)CCNC(=O)[C@@H]1Cc2ccccc2CN1C(=O)[C@@H](N)Cc1c(C)cc(O)cc1C
: