Target
Prostaglandin D2 receptor 2
Ligand
BDBM50312906
Substrate
Meas. Tech.
ChEMBL_615900 (CHEMBL1102914)
IC50
3.4±n/a nM
Citation
 Grimstrup, MReceveur, JMRist, ØFrimurer, TMNielsen, PAMathiesen, JMHögberg, T Exploration of SAR features by modifications of thiazoleacetic acids as CRTH2 antagonists. Bioorg Med Chem Lett 20:1638-41 (2010)  
Target
Name:
Prostaglandin D2 receptor 2
Synonyms:
CD294 antigen G protein-coupled receptor 44 PD2R2_MOUSE | Ptgdr2
Type:
G Protein-Coupled Receptor (GPCR)
Mol. Mass.:
42975.89
Organism:
Mus musculus (mouse)
Description:
Human embryonic kidney (HEK) 293(EBNA) cells were transfected with mouse CRTH2.
Residue:
382
  
Inhibitor
Name:
BDBM50312906
Synonyms:
2-(2-(bis(4-fluorophenyl)methyl)-4-(3-fluorophenyl)pyrimidin-5-yl)acetic acid | CHEMBL1088284
Type:
Small organic molecule
Emp. Form.:
C25H17F3N2O2
Mol. Mass.:
434.4099
SMILES:
OC(=O)Cc1cnc(nc1-c1cccc(F)c1)C(c1ccc(F)cc1)c1ccc(F)cc1
: