Target
Prostaglandin D2 receptor 2
Ligand
BDBM50312906
Substrate
Meas. Tech.
ChEMBL_615901 (CHEMBL1102915)
IC50
29±n/a nM
Citation
 Grimstrup, MReceveur, JMRist, ØFrimurer, TMNielsen, PAMathiesen, JMHögberg, T Exploration of SAR features by modifications of thiazoleacetic acids as CRTH2 antagonists. Bioorg Med Chem Lett 20:1638-41 (2010)  
Target
Name:
Prostaglandin D2 receptor 2
Synonyms:
Chemoattractant receptor-homologous molecule expressed on Th2 cells
Type:
PROTEIN
Mol. Mass.:
42241.65
Organism:
Cavia porcellus
Description:
ChEMBL_797760
Residue:
391
  
Inhibitor
Name:
BDBM50312906
Synonyms:
2-(2-(bis(4-fluorophenyl)methyl)-4-(3-fluorophenyl)pyrimidin-5-yl)acetic acid | CHEMBL1088284
Type:
Small organic molecule
Emp. Form.:
C25H17F3N2O2
Mol. Mass.:
434.4099
SMILES:
OC(=O)Cc1cnc(nc1-c1cccc(F)c1)C(c1ccc(F)cc1)c1ccc(F)cc1
: