Target
Adenosine receptor A2a
Ligand
BDBM50312946
Substrate
Meas. Tech.
ChEMBL_616079 (CHEMBL1102042)
Ki
35±n/a nM
Citation
 Eastwood, PGonzalez, JParedes, SNueda, ADomenech, TAlberti, JVidal, B Discovery of N-(5,6-diarylpyridin-2-yl)amide derivatives as potent and selective A(2B) adenosine receptor antagonists. Bioorg Med Chem Lett 20:1697-700 (2010)  
Target
Name:
Adenosine receptor A2a
Synonyms:
A2A adenosine receptor (hA2A) ADENOSINE A2 ADORA2 Adenosine A2A receptor (A2AAR)
Type:
G Protein-Coupled Receptor (GPCR)
Mol. Mass.:
44716.46
Organism:
Homo sapiens (Human)
Description:
P29274
Residue:
412
  
Inhibitor
Name:
BDBM50312946
Synonyms:
CHEMBL1076562 | N-(5-bromo-6-(furan-2-yl)pyridin-2-yl)cyclopropanecarboxamide
Type:
Small organic molecule
Emp. Form.:
C13H11BrN2O2
Mol. Mass.:
307.143
SMILES:
Brc1ccc(NC(=O)C2CC2)nc1-c1ccco1
: