Target
Adenosine receptor A2a
Ligand
BDBM50312966
Substrate
Meas. Tech.
ChEMBL_616079 (CHEMBL1102042)
Ki
239±n/a nM
Citation
 Eastwood, PGonzalez, JParedes, SNueda, ADomenech, TAlberti, JVidal, B Discovery of N-(5,6-diarylpyridin-2-yl)amide derivatives as potent and selective A(2B) adenosine receptor antagonists. Bioorg Med Chem Lett 20:1697-700 (2010)  
Target
Name:
Adenosine receptor A2a
Synonyms:
A2A adenosine receptor (hA2A) ADENOSINE A2 ADORA2 Adenosine A2A receptor (A2AAR)
Type:
G Protein-Coupled Receptor (GPCR)
Mol. Mass.:
44716.46
Organism:
Homo sapiens (Human)
Description:
P29274
Residue:
412
  
Inhibitor
Name:
BDBM50312966
Synonyms:
CHEMBL1081971 | N-(6-(furan-2-yl)-5-(pyrimidin-4-yl)pyridin-2-yl)cyclopropanecarboxamide
Type:
Small organic molecule
Emp. Form.:
C17H14N4O2
Mol. Mass.:
306.3187
SMILES:
O=C(Nc1ccc(-c2ccncn2)c(n1)-c1ccco1)C1CC1
: