Target
Tyrosine-protein kinase JAK1
Ligand
BDBM50312975
Substrate
Meas. Tech.
ChEMBL_616102 (CHEMBL1102771)
IC50
710±n/a nM
Citation
 Gerspacher, MFuret, PPissot-Soldermann, CGaul, CHolzer, PVangrevelinghe, ELang, MErdmann, DRadimerski, TRegnier, CHChene, PDe Pover, AHofmann, FBaffert, FBuhl, TAichholz, RBlasco, FEndres, RTrappe, JDrueckes, P 2-Amino-aryl-7-aryl-benzoxazoles as potent, selective and orally available JAK2 inhibitors. Bioorg Med Chem Lett 20:1724-7 (2010)  
Target
Name:
Tyrosine-protein kinase JAK1
Synonyms:
JAK-1 JAK1A JAK1_HUMAN Janus kinase 1 (JAK1) | Janus kinase 1 JAK1
Type:
Protein
Mol. Mass.:
133293.73
Organism:
Homo sapiens (Human)
Description:
P23458
Residue:
1154
  
Inhibitor
Name:
BDBM50312975
Synonyms:
7-phenyl-N-(3,4,5-trimethoxyphenyl)benzo[d]oxazol-2-amine | CHEMBL1081290
Type:
Small organic molecule
Emp. Form.:
C22H20N2O4
Mol. Mass.:
376.4052
SMILES:
COc1cc(Nc2nc3cccc(-c4ccccc4)c3o2)cc(OC)c1OC
: