Target
Tyrosine-protein kinase JAK1
Ligand
BDBM50312984
Substrate
Meas. Tech.
ChEMBL_616102 (CHEMBL1102771)
IC50
180±n/a nM
Citation
 Gerspacher, MFuret, PPissot-Soldermann, CGaul, CHolzer, PVangrevelinghe, ELang, MErdmann, DRadimerski, TRegnier, CHChene, PDe Pover, AHofmann, FBaffert, FBuhl, TAichholz, RBlasco, FEndres, RTrappe, JDrueckes, P 2-Amino-aryl-7-aryl-benzoxazoles as potent, selective and orally available JAK2 inhibitors. Bioorg Med Chem Lett 20:1724-7 (2010)  
Target
Name:
Tyrosine-protein kinase JAK1
Synonyms:
JAK-1 JAK1A JAK1_HUMAN Janus kinase 1 (JAK1) | Janus kinase 1 JAK1
Type:
Protein
Mol. Mass.:
133293.73
Organism:
Homo sapiens (Human)
Description:
P23458
Residue:
1154
  
Inhibitor
Name:
BDBM50312984
Synonyms:
CHEMBL1081663 | N,N-dimethyl-4-(7-(4-(morpholine-4-carbonyl)phenyl)benzo[d]oxazol-2-ylamino)benzamide
Type:
Small organic molecule
Emp. Form.:
C27H26N4O4
Mol. Mass.:
470.5197
SMILES:
CN(C)C(=O)c1ccc(Nc2nc3cccc(-c4ccc(cc4)C(=O)N4CCOCC4)c3o2)cc1
: