Target
Tyrosine-protein kinase JAK2
Ligand
BDBM50312985
Substrate
Meas. Tech.
ChEMBL_616101 (CHEMBL1102770)
IC50
8±n/a nM
Citation
 Gerspacher, MFuret, PPissot-Soldermann, CGaul, CHolzer, PVangrevelinghe, ELang, MErdmann, DRadimerski, TRegnier, CHChene, PDe Pover, AHofmann, FBaffert, FBuhl, TAichholz, RBlasco, FEndres, RTrappe, JDrueckes, P 2-Amino-aryl-7-aryl-benzoxazoles as potent, selective and orally available JAK2 inhibitors. Bioorg Med Chem Lett 20:1724-7 (2010)  
Target
Name:
Tyrosine-protein kinase JAK2
Synonyms:
JAK-2 JAK2_HUMAN Janus kinase 2 (JAK2) | Janus kinase 2 (a protein tyrosine kinase)
Type:
Protein
Mol. Mass.:
130684.68
Organism:
Homo sapiens (Human)
Description:
O60674
Residue:
1132
  
Inhibitor
Name:
BDBM50312985
Synonyms:
CHEMBL1081664 | N,N,2-trimethyl-4-(7-(4-(morpholine-4-carbonyl)phenyl)benzo[d]oxazol-2-ylamino)benzamide
Type:
Small organic molecule
Emp. Form.:
C28H28N4O4
Mol. Mass.:
484.5463
SMILES:
CN(C)C(=O)c1ccc(Nc2nc3cccc(-c4ccc(cc4)C(=O)N4CCOCC4)c3o2)cc1C
: