Target
Non-receptor tyrosine-protein kinase TYK2
Ligand
BDBM50312989
Substrate
Meas. Tech.
ChEMBL_616104 (CHEMBL1102773)
IC50
97±n/a nM
Citation
 Gerspacher, MFuret, PPissot-Soldermann, CGaul, CHolzer, PVangrevelinghe, ELang, MErdmann, DRadimerski, TRegnier, CHChene, PDe Pover, AHofmann, FBaffert, FBuhl, TAichholz, RBlasco, FEndres, RTrappe, JDrueckes, P 2-Amino-aryl-7-aryl-benzoxazoles as potent, selective and orally available JAK2 inhibitors. Bioorg Med Chem Lett 20:1724-7 (2010)  
Target
Name:
Non-receptor tyrosine-protein kinase TYK2
Synonyms:
Non-receptor tyrosine-protein kinase TYK2 (TYK2) TYK2_HUMAN | Tyrosine-protein kinase TYK2
Type:
Protein
Mol. Mass.:
133666.03
Organism:
Homo sapiens (Human)
Description:
P29597
Residue:
1187
  
Inhibitor
Name:
BDBM50312989
Synonyms:
4-(7-(3,5-difluoro-4-(morpholinomethyl)phenyl)benzo[d]oxazol-2-ylamino)-N-(3-(dimethylamino)propyl)-2-methylbenzamide | CHEMBL1076700
Type:
Small organic molecule
Emp. Form.:
C31H35F2N5O3
Mol. Mass.:
563.6381
SMILES:
CN(C)CCCNC(=O)c1ccc(Nc2nc3cccc(-c4cc(F)c(CN5CCOCC5)c(F)c4)c3o2)cc1C
: