Target
Acetylcholinesterase
Ligand
BDBM50119779
Substrate
Meas. Tech.
ChEMBL_616422 (CHEMBL1100708)
IC50
400±n/a nM
Citation
 Musilek, KKomloova, MZavadova, VHolas, OHrabinova, MPohanka, MDohnal, VNachon, FDolezal, MKuca, KJung, YS Preparation and in vitro screening of symmetrical bispyridinium cholinesterase inhibitors bearing different connecting linkage-initial study for Myasthenia gravis implications. Bioorg Med Chem Lett 20:1763-6 (2010)  
Target
Name:
Acetylcholinesterase
Synonyms:
ACES_HUMAN Acetylcholinesterase (AChE) | Acetylcholinesterase (human AChE)
Type:
Enzyme
Mol. Mass.:
67792.70
Organism:
Homo sapiens (Human)
Description:
P22303
Residue:
614
  
Inhibitor
Name:
BDBM50119779
Synonyms:
1,1'-(decane-1,10-diyl)dipyridinium iodide 1,10-di(1-pyridiniumyl)decane; diiodide CHEMBL225689
Type:
Small organic molecule
Emp. Form.:
C20H30N2
Mol. Mass.:
298.4645
SMILES:
C(CCCCC[n+]1ccccc1)CCCC[n+]1ccccc1
: