Target
5-hydroxytryptamine receptor 6
Ligand
BDBM50313131
Substrate
Meas. Tech.
ChEMBL_616577 (CHEMBL1099714)
EC50
31±n/a nM
Citation
 Bernotas, RCAntane, SShenoy, RLe, VDChen, PHarrison, BLRobichaud, AJZhang, GMSmith, DSchechter, LE 3-(Arylsulfonyl)-1-(azacyclyl)-1H-indoles are 5-HT(6) receptor modulators. Bioorg Med Chem Lett 20:1657-60 (2010)  
Target
Name:
5-hydroxytryptamine receptor 6
Synonyms:
5-HT-6 5-hydroxytryptamine receptor 6 (5-HT-6) 5-hydroxytryptamine receptor 6 (5HT6) HTR6 Serotonin 6 (5-HT6) receptor | Serotonin Receptor 6
Type:
G Protein-Coupled Receptor (GPCR)
Mol. Mass.:
46968.43
Organism:
Homo sapiens (Human)
Description:
P50406
Residue:
440
  
Inhibitor
Name:
BDBM50313131
Synonyms:
1-(1-ethylpiperidin-3-yl)-3-(phenylsulfonyl)-1H-indole | CHEMBL1081094
Type:
Small organic molecule
Emp. Form.:
C21H24N2O2S
Mol. Mass.:
368.492
SMILES:
CCN1CCCC(C1)n1cc(c2ccccc12)S(=O)(=O)c1ccccc1
: