Target
Tyrosine-protein kinase JAK2
Ligand
BDBM50313159
Substrate
Meas. Tech.
ChEMBL_616799 (CHEMBL1103123)
IC50
3±n/a nM
Citation
 Ioannidis, SLamb, MLAlmeida, LGuan, HPeng, BBebernitz, GBell, KAlimzhanov, MZinda, M Replacement of pyrazol-3-yl amine hinge binder with thiazol-2-yl amine: Discovery of potent and selective JAK2 inhibitors. Bioorg Med Chem Lett 20:1669-73 (2010)  
Target
Name:
Tyrosine-protein kinase JAK2
Synonyms:
JAK-2 JAK2_HUMAN Janus kinase 2 (JAK2) | Janus kinase 2 (a protein tyrosine kinase)
Type:
Protein
Mol. Mass.:
130684.68
Organism:
Homo sapiens (Human)
Description:
O60674
Residue:
1132
  
Inhibitor
Name:
BDBM50313159
Synonyms:
(S)-N2-(1-(5-fluoropyrimidin-2-yl)ethyl)-N4-(5-methylthiazol-2-yl)-6-morpholinopyrimidine-2,4-diamine | CHEMBL1088030
Type:
Small organic molecule
Emp. Form.:
C18H21FN8OS
Mol. Mass.:
416.476
SMILES:
C[C@H](Nc1nc(Nc2ncc(C)s2)cc(n1)N1CCOCC1)c1ncc(F)cn1
: