Target
Sodium/glucose cotransporter 2
Ligand
BDBM50313368
Substrate
Meas. Tech.
ChEMBL_617327 (CHEMBL1101142)
IC50
6.6±n/a nM
Citation
 Robinson, RPMascitti, VBoustany-Kari, CMCarr, CLFoley, PMKimoto, ELeininger, MTLowe, AKlenotic, MKMacdonald, JIMaguire, RJMasterson, VMMaurer, TSMiao, ZPatel, JDPréville, CReese, MRShe, LSteppan, CMThuma, BAZhu, T C-Aryl glycoside inhibitors of SGLT2: Exploration of sugar modifications including C-5 spirocyclization. Bioorg Med Chem Lett 20:1569-72 (2010)  
Target
Name:
Sodium/glucose cotransporter 2
Synonyms:
Na(+)/glucose cotransporter 2 SGLT2 Sodium-Dependent Glucose Cotransporter 2 (SGLT2) Solute carrier family 5 member 2
Type:
Protein
Mol. Mass.:
72902.00
Organism:
Homo sapiens (Human)
Description:
P31639
Residue:
672
  
Inhibitor
Name:
BDBM50313368
Synonyms:
(6S,7R,8R,9S)-6-(3-(4-methoxybenzyl)-4-methylphenyl)-2,5-dioxaspiro[3.5]nonane-7,8,9-triol | CHEMBL1090058
Type:
Small organic molecule
Emp. Form.:
C22H26O6
Mol. Mass.:
386.4382
SMILES:
COc1ccc(Cc2cc(ccc2C)[C@@H]2OC3(COC3)[C@@H](O)[C@H](O)[C@H]2O)cc1
: