Target
Glycylpeptide N-tetradecanoyltransferase 1
Ligand
BDBM50313451
Substrate
Meas. Tech.
ChEMBL_617371 (CHEMBL1101882)
IC50
7550000±n/a nM
Citation
 Jha, AMukherjee, CPrasad, AKParmar, VSVadaparti, MDas, UDe Clercq, EBalzarini, JStables, JPShrivastav, ASharma, RKDimmock, JR Derivatives of aryl amines containing the cytotoxic 1,4-dioxo-2-butenyl pharmacophore. Bioorg Med Chem Lett 20:1510-5 (2010)  
Target
Name:
Glycylpeptide N-tetradecanoyltransferase 1
Synonyms:
Myristoyl-CoA:protein N-myristoyltransferase (Nmt) NMT NMT1_HUMAN Peptide N-myristoyltransferase 1
Type:
Enzyme
Mol. Mass.:
56814.10
Organism:
Homo sapiens (Human)
Description:
P30419
Residue:
496
  
Inhibitor
Name:
BDBM50313451
Synonyms:
(E)-4-(3,4-dimethylphenylamino)-4-oxobut-2-enoic acid | CHEMBL1084932
Type:
Small organic molecule
Emp. Form.:
C12H13NO3
Mol. Mass.:
219.2365
SMILES:
Cc1ccc(NC(=O)\C=C\C(O)=O)cc1C
: