Target
Neuropilin-1
Ligand
BDBM50313481
Substrate
Meas. Tech.
ChEMBL_617636 (CHEMBL1101245)
IC50
18000±n/a nM
Citation
 Jarvis, AAllerston, CKJia, HHerzog, BGarza-Garcia, AWinfield, NEllard, KAqil, RLynch, RChapman, CHartzoulakis, BNally, JStewart, MCheng, LMenon, MTickner, MDjordjevic, SDriscoll, PCZachary, ISelwood, DL Small molecule inhibitors of the neuropilin-1 vascular endothelial growth factor A (VEGF-A) interaction. J Med Chem 53:2215-26 (2010)  
Target
Name:
Neuropilin-1
Synonyms:
Chain A, Crystal Structure Of The B1b2 Domains From Human Neuropilin- 1 NRP1 Neuropilin-1 | VEGF165R
Type:
PROTEIN
Mol. Mass.:
103122.09
Organism:
Homo sapiens (Human)
Description:
ChEMBL_617636
Residue:
923
  
Inhibitor
Name:
BDBM50313481
Synonyms:
(2S)-2-((2S)-2-((2S)-1-((6S,12S,15S)-6-acetamido-1,19-diamino-12-(carboxymethyl)-9-ethyl-1-imino-7,10,13-trioxo-2,8,11,14-tetraazanonadecanecarbonyl)pyrrolidine-2-carboxamido)propanamido)-5-guanidinopentanoic acid | CHEMBL1077253
Type:
Small organic molecule
Emp. Form.:
C36H64N14O11
Mol. Mass.:
868.9806
SMILES:
[#6]-[#6]-[#6](-[#7]-[#6](=O)-[#6@H](-[#6]-[#6]-[#6]\[#7]=[#6](\[#7])-[#7])-[#7]-[#6](-[#6])=O)-[#6](=O)-[#7]-[#6@@H](-[#6]-[#6](-[#8])=O)-[#6](=O)-[#7]-[#6@@H](-[#6]-[#6]-[#6]-[#6]-[#7])-[#6](=O)-[#7]-1-[#6]-[#6]-[#6]-[#6@H]-1-[#6](=O)-[#7]-[#6@@H](-[#6])-[#6](=O)-[#7]-[#6@@H](-[#6]-[#6]-[#6]\[#7]=[#6](/[#7])-[#7])-[#6](-[#8])=O
: