Target
Glycogen synthase kinase-3 beta
Ligand
BDBM50244787
Substrate
Meas. Tech.
ChEMBL_614721 (CHEMBL1114224)
IC50
4100±n/a nM
Citation
 Morphy, R Selectively nonselective kinase inhibition: striking the right balance. J Med Chem 53:1413-37 (2010)  
Target
Name:
Glycogen synthase kinase-3 beta
Synonyms:
GSK-3 beta GSK3B Glycogen synthase kinase 3 beta (GSK3B) Glycogen synthase kinase-3 beta (GSK-3B) Glycogen synthase kinase-3 beta (GSK3B) Glycogen synthase kinase-3beta (GSK3B) | Serine/threonine-protein kinase GSK3B
Type:
Enzyme
Mol. Mass.:
46756.38
Organism:
Homo sapiens (Human)
Description:
P49841
Residue:
420
  
Inhibitor
Name:
BDBM50244787
Synonyms:
(R)-2-(1-Hydroxybut-2-ylamino)-6-[3-(2-pyridyl)phenylamino]-9-isopropylpurine | CHEMBL215919
Type:
Small organic molecule
Emp. Form.:
C23H27N7O
Mol. Mass.:
417.5068
SMILES:
CC[C@H](CO)Nc1nc(Nc2cccc(c2)-c2ccccn2)c2ncn(C(C)C)c2n1
: