Target
Bombesin receptor subtype-3
Ligand
BDBM50313748
Substrate
Meas. Tech.
ChEMBL_614790 (CHEMBL1113309)
EC50
6.2±n/a nM
Citation
 He, SDobbelaar, PHLiu, JJian, TSebhat, IKLin, LSGoodman, AGuo, CGuzzo, PRHadden, MHenderson, AJRuenz, MSargent, BJYet, LKelly, TMPalyha, OKan, YPan, JChen, HMarsh, DJShearman, LPStrack, AMMetzger, JMFeighner, SDTan, CHoward, ADTamvakopoulos, CPeng, QGuan, XMReitman, MLPatchett, AAWyvratt, MJNargund, RP Discovery of substituted biphenyl imidazoles as potent, bioavailable bombesin receptor subtype-3 agonists. Bioorg Med Chem Lett 20:1913-7 (2010)  
Target
Name:
Bombesin receptor subtype-3
Synonyms:
BRS3_MOUSE | Brs3
Type:
PROTEIN
Mol. Mass.:
44239.49
Organism:
Mus musculus
Description:
ChEMBL_1445902
Residue:
399
  
Inhibitor
Name:
BDBM50313748
Synonyms:
4'-(2-(5-(3,3-dimethylbutyl)-1H-imidazol-2-yl)ethyl)biphenyl-2-carboxylic acid | CHEMBL1089382
Type:
Small organic molecule
Emp. Form.:
C24H28N2O2
Mol. Mass.:
376.4913
SMILES:
CC(C)(C)CCc1cnc(CCc2ccc(cc2)-c2ccccc2C(O)=O)[nH]1
: