Target
Metacaspase-2
Ligand
BDBM50313766
Substrate
Meas. Tech.
ChEMBL_614949 (CHEMBL1116826)
IC50
>100000±n/a nM
Citation
 Berg, MVan der Veken, PJoossens, JMuthusamy, VBreugelmans, MMoss, CXRudolf, JCos, PCoombs, GHMaes, LHaemers, AMottram, JCAugustyns, K Design and evaluation of Trypanosoma brucei metacaspase inhibitors. Bioorg Med Chem Lett 20:2001-6 (2010)  
Target
Name:
Metacaspase-2
Synonyms:
Metacaspase
Type:
PROTEIN
Mol. Mass.:
37791.17
Organism:
Trypanosoma brucei
Description:
ChEMBL_614949
Residue:
347
  
Inhibitor
Name:
BDBM50313766
Synonyms:
CHEMBL1091471 | benzyl cyanomethyl(4-(pyrrolidin-1-yl)butyl)carbamate
Type:
Small organic molecule
Emp. Form.:
C18H25N3O2
Mol. Mass.:
315.41
SMILES:
O=C(OCc1ccccc1)N(CCCCN1CCCC1)CC#N
: