Target
Metacaspase-2
Ligand
BDBM50313780
Substrate
Meas. Tech.
ChEMBL_614949 (CHEMBL1116826)
IC50
>100000±n/a nM
Citation
 Berg, MVan der Veken, PJoossens, JMuthusamy, VBreugelmans, MMoss, CXRudolf, JCos, PCoombs, GHMaes, LHaemers, AMottram, JCAugustyns, K Design and evaluation of Trypanosoma brucei metacaspase inhibitors. Bioorg Med Chem Lett 20:2001-6 (2010)  
Target
Name:
Metacaspase-2
Synonyms:
Metacaspase
Type:
PROTEIN
Mol. Mass.:
37791.17
Organism:
Trypanosoma brucei
Description:
ChEMBL_614949
Residue:
347
  
Inhibitor
Name:
BDBM50313780
Synonyms:
(S)-benzyl 2-(4-aminophenyl)-1-cyanoethylcarbamate | CHEMBL1089375
Type:
Small organic molecule
Emp. Form.:
C17H17N3O2
Mol. Mass.:
295.3358
SMILES:
Nc1ccc(C[C@H](NC(=O)OCc2ccccc2)C#N)cc1
: