Target
Corticotropin-releasing factor receptor 1
Ligand
BDBM50313872
Substrate
Meas. Tech.
ChEMBL_615438 (CHEMBL1106905)
IC50
240±n/a nM
Citation
 Hartz, RAAhuja, VTSchmitz, WDMolski, TFMattson, GKLodge, NJBronson, JJMacor, JE Synthesis and structure-activity relationships of N3-pyridylpyrazinones as corticotropin-releasing factor-1 (CRF1) receptor antagonists. Bioorg Med Chem Lett 20:1890-4 (2010)  
Target
Name:
Corticotropin-releasing factor receptor 1
Synonyms:
CRF-R CRFR1_RAT Corticotropin releasing factor receptor Corticotropin-releasing Factor Receptor 1 Crhr | Crhr1
Type:
G Protein-Coupled Receptor (GPCR)
Mol. Mass.:
47870.75
Organism:
Rattus norvegicus (rat)
Description:
Receptor binding assays were performed using rat cortex homogenate.
Residue:
415
  
Inhibitor
Name:
BDBM50313872
Synonyms:
(R)-5-chloro-1-(1-cyclopropylethyl)-3-(2,4-dimethoxy-6-methylpyrimidin-5-ylamino)pyrazin-2(1H)-one | CHEMBL1077299
Type:
Small organic molecule
Emp. Form.:
C16H20ClN5O3
Mol. Mass.:
365.815
SMILES:
COc1nc(C)c(Nc2nc(Cl)cn([C@H](C)C3CC3)c2=O)c(OC)n1
: