Target
D(3) dopamine receptor
Ligand
BDBM50313915
Substrate
Meas. Tech.
ChEMBL_615496 (CHEMBL1105126)
Ki
>10000±n/a nM
Citation
 Robaa, DEnzensperger, CAbul Azm, Sel DEl Khawass, el SEl Sayed, OLehmann, J Dopamine receptor ligands. Part 18: (1) modification of the structural skeleton of indolobenzazecine-type dopamine receptor antagonists. J Med Chem 53:2646-50 (2010)  
Target
Name:
D(3) dopamine receptor
Synonyms:
DOPAMINE D3 DRD3_HUMAN Dopamine D3 receptor (D3) Dopamine receptor Dopamine receptor D3
Type:
Mol. Mass.:
44243.43
Organism:
Homo sapiens (Human)
Description:
Residue:
400
  
Inhibitor
Name:
BDBM50313915
Synonyms:
2,8,9,13b-Tetrahydro-6H-isoquino[2,1-b]pyrrolo[4,3,2-de]-isoquinoline | CHEMBL1077189
Type:
Small organic molecule
Emp. Form.:
C18H16N2
Mol. Mass.:
260.333
SMILES:
C1Cc2ccccc2C2N1Cc1cccc3[nH]cc2c13
: