Target
D(3) dopamine receptor
Ligand
BDBM50313916
Substrate
Meas. Tech.
ChEMBL_615496 (CHEMBL1105126)
Ki
513±n/a nM
Citation
 Robaa, DEnzensperger, CAbul Azm, Sel DEl Khawass, el SEl Sayed, OLehmann, J Dopamine receptor ligands. Part 18: (1) modification of the structural skeleton of indolobenzazecine-type dopamine receptor antagonists. J Med Chem 53:2646-50 (2010)  
Target
Name:
D(3) dopamine receptor
Synonyms:
DOPAMINE D3 DRD3_HUMAN Dopamine D3 receptor (D3) Dopamine receptor Dopamine receptor D3
Type:
Mol. Mass.:
44243.43
Organism:
Homo sapiens (Human)
Description:
Residue:
400
  
Inhibitor
Name:
BDBM50313916
Synonyms:
7-Methyl-6,7,8,9,10,15-hexahydroindolo[2,3-f][3]benzazecine | CHEMBL1087301
Type:
Small organic molecule
Emp. Form.:
C20H22N2
Mol. Mass.:
290.4021
SMILES:
CN1CCc2[nH]c3ccccc3c2Cc2ccccc2CC1
: