Target
Corticotropin-releasing factor receptor 1
Ligand
BDBM50314018
Substrate
Meas. Tech.
ChEMBL_615933 (CHEMBL1099779)
Ki
245±n/a nM
Citation
 Vrudhula, VMDasgupta, BPin, SSBurris, KDBalanda, LAFung, LKFiedler, TBrowman, KETaber, MTZhang, JMacor, JEDubowchik, GM Design, synthesis and evaluation of constrained tetrahydroimidazopyrimidine derivatives as antagonists of corticotropin-releasing factor type 1 receptor (CRF1R). Bioorg Med Chem Lett 20:1905-9 (2010)  
Target
Name:
Corticotropin-releasing factor receptor 1
Synonyms:
CRF-R CRF1 CRFR1 CRH-R 1 CRHR1 Corticotropin-releasing factor receptor 1 (CRF-1) Corticotropin-releasing hormone receptor 1
Type:
Enzyme
Mol. Mass.:
50744.31
Organism:
Homo sapiens (Human)
Description:
P34998
Residue:
444
  
Inhibitor
Name:
BDBM50314018
Synonyms:
8-mesityl-3-(piperidin-1-ylmethyl)-2-(trifluoromethyl)-5,6,7,8-tetrahydroimidazo[1,2-a]pyrimidine | CHEMBL1087805
Type:
Small organic molecule
Emp. Form.:
C22H29F3N4
Mol. Mass.:
406.4877
SMILES:
Cc1cc(C)c(N2CCCn3c(CN4CCCCC4)c(nc23)C(F)(F)F)c(C)c1
: