Target
Complement factor B
Ligand
BDBM50314026
Substrate
Meas. Tech.
ChEMBL_626639 (CHEMBL1112746)
pH
9.5±n/a
IC50
12000±n/a nM
Comments
extracted
Citation
 Ruiz-Gómez, GLim, JHalili, MALe, GTMadala, PKAbbenante, GFairlie, DP Structure-activity relationships for substrate-based inhibitors of human complement factor B. J Med Chem 52:6042-52 (2009)  
Target
Name:
Complement factor B
Synonyms:
BF CFAB_HUMAN | CFB
Type:
Enzyme
Mol. Mass.:
85537.97
Organism:
Homo sapiens (Human)
Description:
P00751
Residue:
764
  
Inhibitor
Name:
BDBM50314026
Synonyms:
(6S,9S,12S,15S)-1-amino-1-imino-12,15-diisobutyl-9-methyl-8,11,14,17-tetraoxo-2,7,10,13,16-pentaazaoctadecane-6-carboxylic acid | CHEMBL1093412
Type:
Small organic molecule
Emp. Form.:
C23H43N7O6
Mol. Mass.:
513.6308
SMILES:
[#6]-[#6](-[#6])-[#6]-[#6@H](-[#7]-[#6](-[#6])=O)-[#6](=O)-[#7]-[#6@@H](-[#6]-[#6](-[#6])-[#6])-[#6](=O)-[#7]-[#6@@H](-[#6])-[#6](=O)-[#7]-[#6@@H](-[#6]-[#6]-[#6]\[#7]=[#6](/[#7])-[#7])-[#6](-[#8])=O
: