Target
IgG receptor FcRn large subunit p51
Ligand
BDBM50314081
Substrate
Meas. Tech.
ChEMBL_627629 (CHEMBL1114459)
IC50
1000±n/a nM
Citation
 McDonnell, KALow, SCHoehn, TDonnelly, RPalmieri, HFraley, CSakorafas, PMezo, AR Synthesis and structure-activity relationships of dimeric peptide antagonists of the human immunoglobulin G-human neonatal Fc receptor (IgG-FcRn) interaction. J Med Chem 53:1587-96 (2010)  
Target
Name:
IgG receptor FcRn large subunit p51
Synonyms:
FCGRN_HUMAN FCRN
Type:
PROTEIN
Mol. Mass.:
39742.86
Organism:
Homo sapiens (Human)
Description:
ChEMBL_627631
Residue:
365
  
Inhibitor
Name:
BDBM50314081
Synonyms:
(3R,8R,11S,17S,26S,29S,35aS)-8-((S)-2-((S)-2-acetamido-5-guanidinopentanamido)-3-phenylpropanamido)-17-(4-guanidinobenzyl)-29-(4-hydroxybenzyl)-11-((R)-1-hydroxyethyl)-26-isobutyl-7,7,22,25-tetramethyl-1,9,12,15,18,21,24,27,30,31-decaoxodotriacontahydro-1H-pyrrolo[2,1-g][1,2,5,8,12,15,18,21,24,27,30]dithianonaazacyclotritriacontine-3-carboxamide | CHEMBL1089949
Type:
Small organic molecule
Emp. Form.:
C68H97N19O16S2
Mol. Mass.:
1500.745
SMILES:
[#6]-[#6](-[#6])-[#6]-[#6@@H]-1-[#7](-[#6])-[#6](=O)-[#6]-[#7](-[#6])-[#6](=O)-[#6]-[#7]-[#6](=O)-[#6@H](-[#6]-c2ccc(cc2)\[#7]=[#6](\[#7])-[#7])-[#7]-[#6](=O)-[#6]-[#7]-[#6](=O)-[#6@@H](-[#7]-[#6](=O)-[#6@@H](-[#7]-[#6](=O)-[#6@H](-[#6]-c2ccccc2)-[#7]-[#6](=O)-[#6@H](-[#6]-[#6]-[#6]-[#7]-[#6](-[#7])=[#7])-[#7]-[#6](-[#6])=O)C([#6])([#6])[#16]-[#16]-[#6]-[#6@H](-[#7]-[#6](=O)-[#6@@H]-2-[#6]-[#6]-[#6]-[#7]-2-[#6](=O)-[#6](=O)-[#6@H](-[#6]-c2ccc(-[#8])cc2)-[#7]-[#6]-1=O)-[#6](-[#7])=O)-[#6@@H](-[#6])-[#8]
: