Target
IgG receptor FcRn large subunit p51
Ligand
BDBM50314098
Substrate
Meas. Tech.
ChEMBL_627629 (CHEMBL1114459)
IC50
4.7±n/a nM
Citation
 McDonnell, KALow, SCHoehn, TDonnelly, RPalmieri, HFraley, CSakorafas, PMezo, AR Synthesis and structure-activity relationships of dimeric peptide antagonists of the human immunoglobulin G-human neonatal Fc receptor (IgG-FcRn) interaction. J Med Chem 53:1587-96 (2010)  
Target
Name:
IgG receptor FcRn large subunit p51
Synonyms:
FCGRN_HUMAN FCRN
Type:
PROTEIN
Mol. Mass.:
39742.86
Organism:
Homo sapiens (Human)
Description:
ChEMBL_627631
Residue:
365
  
Inhibitor
Name:
BDBM50314098
Synonyms:
CHEMBL1090636
Type:
Small organic molecule
Emp. Form.:
C147H203N39O34S4
Mol. Mass.:
3188.686
SMILES:
CC(C)C[C@@H]1N(C)C(=O)CN(C)C(=O)CNC(=O)[C@H](Cc2ccccc2)NC(=O)[C@H](Cc2cnc[nH]2)NC(=O)CNC(=O)[C@@H](NC(=O)[C@@H](NC(=O)[C@H](Cc2ccccc2)NC(=O)[C@H](CCCNC(N)=N)NC(=O)CN(C)CC(=O)N[C@@H](CCCNC(N)=N)C(=O)N[C@@H](Cc2ccccc2)C(=O)N[C@@H]2C(=O)N[C@@H]([C@@H](C)O)C(=O)NCC(=O)N[C@@H](Cc3cnc[nH]3)C(=O)N[C@@H](Cc3ccccc3)C(=O)NCC(=O)N(C)CC(=O)N(C)[C@@H](CC(C)C)C(=O)N[C@@H](Cc3ccc(O)cc3)C(=O)C(=O)N3CCC[C@H]3C(=O)N[C@@H](CSSC2(C)C)C(N)=O)C(C)(C)SSC[C@H](NC(=O)[C@@H]2CCCN2C(=O)C(=O)[C@H](Cc2ccc(O)cc2)NC1=O)C(N)=O)[C@@H](C)O
: