Target
Mitogen-activated protein kinase 8
Ligand
BDBM50314147
Substrate
Meas. Tech.
ChEMBL_624058 (CHEMBL1116944)
Ki
3±n/a nM
Citation
 Siddiqui, MAReddy, PA Small molecule JNK (c-Jun N-terminal kinase) inhibitors. J Med Chem 53:3005-12 (2010)  
Target
Name:
Mitogen-activated protein kinase 8
Synonyms:
JNK-46 JNK1-alpha-1 MK08_HUMAN PRKM8 SAPK1C c-Jun N-terminal kinase 1 c-Jun N-terminal kinase 1(JNK1) | c-Jun N-terminal kinase 2 (JNK2)
Type:
Enzyme
Mol. Mass.:
48297.57
Organism:
Homo sapiens (Human)
Description:
JNK-1 was purchased from Upstate Cell Signaling Solutions (formerly Upstate Biotechnology).
Residue:
427
  
Inhibitor
Name:
BDBM50314147
Synonyms:
CHEMBL1094014 | trans-4-(4-(1-benzyl-5-(dimethylamino)-1H-pyrazol-4-yl)pyrimidin-2-ylamino)cyclohexanol
Type:
Small organic molecule
Emp. Form.:
C22H28N6O
Mol. Mass.:
392.4973
SMILES:
CN(C)c1c(cnn1Cc1ccccc1)-c1ccnc(N[C@H]2CC[C@H](O)CC2)n1
: