Target
Eukaryotic elongation factor 2 kinase
Ligand
BDBM50314414
Substrate
Meas. Tech.
ChEMBL_624587 (CHEMBL1111547)
IC50
>20000±n/a nM
Citation
 Lockman, JWReeder, MDSuzuki, KOstanin, KHoff, RBhoite, LAustin, HBaichwal, VAdam Willardsen, J Inhibition of eEF2-K by thieno[2,3-b]pyridine analogues. Bioorg Med Chem Lett 20:2283-6 (2010)  
Target
Name:
Eukaryotic elongation factor 2 kinase
Synonyms:
Calcium/calmodulin-dependent eukaryotic elongation factor 2 kinase EF2K_HUMAN Eukaryotic elongation factor 2 kinase (eEF-2K) eEF-2 kinase | eEF-2K
Type:
Protein
Mol. Mass.:
82116.99
Organism:
Homo sapiens (Human)
Description:
Residue:
725
  
Inhibitor
Name:
BDBM50314414
Synonyms:
3-amino-4-phenyl-5,6,7,8,9,10-hexahydrocycloocta[b]thieno[3,2-e]pyridine-2-carboxamide | CHEMBL1090044
Type:
Small organic molecule
Emp. Form.:
C20H21N3OS
Mol. Mass.:
351.465
SMILES:
NC(=O)c1sc2nc3CCCCCCc3c(-c3ccccc3)c2c1N
: